Home > Error Code > Installation Error 1624

Installation Error 1624

Contents

Verify that the program to be upgraded exists on your computer and that you have the correct upgrade patch. 3010 ERROR_SUCCESS_REBOOT_REQUIRED A restart is required to complete the install. This tool uses JavaScript and much of it will not work correctly without it enabled. ERROR_PATCH_PACKAGE_REJECTED1643The patch package is not permitted by system policy. RSS Articles Advanced Search Search the Knowledgebase Top Columbus Packaging Office installation fails with MSI error 1624 Reference Number:AA-00628 Views: 3562 Created: 25/05/2012 11:00 Last Updated: 12/06/2012 13:38 0 Rating/ Voters his comment is here

Contact your support personnel. ERROR_INSTALL_PACKAGE_VERSION1613This installation package cannot be installed by the Windows Installer service. OS updates are current. Verify that the patch package exists and is accessible, or contact the application vendor to verify that this is a valid Windows Installer patch package.

Msi Error Codes

Contact your support personnel. running on Windows XP that is up to date. These errors tend to indicate permission issues on the system during installation of the patch files. Watson Product Search Search None of the above, continue with my search Install of DB2 fails with 'Error applying transforms.' setup; 1033.mst; error 1624 Technote (troubleshooting) Problem(Abstract) Install of DB2 fails

  1. Book your tickets now and visit Synology.
  2. ERROR_INVALID_PARAMETER87One of the parameters was invalid.
  3. A Windows Installer package, patch, or transform that has not been signed by Microsoft cannot be installed on an ARM computer.
  4. C:\CAE1.5 (don't download into your profile / onto your desktop, or a network share).#4 - Re-run the installation.Regards,Ken 1334-87413-580337 Back to top Laticia Bomar Members #5 Laticia Bomar 3 posts Posted
  5. ERROR_PATCH_MANAGED_ADVERTISED_PRODUCT 1651Administrative user failed to apply patch for a per-user managed or a per-machine application that is in advertise state.
  6. For example, the DB2 Installation image is located in D:\db2_install\SERVER\image then copy the transform files ( *.mst ) D:\db2_install\SERVER\image\db2\Windows\SERVER\*.mst to C:\INSTAL~1\EXP\image\db2\Windows\SERVER Delete the copied files after DB2 is successfully installed.

Please turn JavaScript back on and reload this page. ERROR_PATCH_PACKAGE_INVALID1636This patch package could not be opened. or login Share Related Questions Smartlabels via script Windows Logo Testing warning on XP Deploying Acrobat 6.01 with GPO using MSIEXEC switches Repackaging Software that requires a Unique Serial Number Application Windows Installer Error 1619 Re: Update Error: 1624 DNesko48 Oct 13, 2010 11:33 AM (in response to Bojohnso) Here is the error window.Dan NesovicP:619-462-1077F:619-462-2943C:619-520-9639 Like Show 0 Likes(0) Actions 4.

Re: Update Error: 1624 Kwahaes Oct 28, 2010 1:10 PM (in response to DNesko48) I am receiving this same error updating the the same product. Msi Error Code 1603 Verify that the specified transform paths are valid. Contact the application vendor to verify that this is a valid Windows Installer package. The program works ok but I just can't install the update.Dan NesovicP:619-462-1077F:619-462-2943C:619-520-9639 Like Show 0 Likes(0) Actions 6.

ERROR_UNKNOWN_PRODUCT1605This action is only valid for products that are currently installed. Msi Motherboard Error Codes Show 8 replies 1. ERROR_INSTALL_SUSPEND1604Installation suspended, incomplete. ERROR_SUCCESS_REBOOT_INITIATED1641The installer has initiated a restart.

Msi Error Code 1603

This documentation is archived and is not being maintained. Complete that installation before proceeding with this install. Msi Error Codes You must install a Windows service pack that contains a newer version of the Windows Installer service. 1614 ERROR_PRODUCT_UNINSTALLED Product is uninstalled. 1615 ERROR_BAD_QUERY_SYNTAX SQL query syntax invalid or unsupported. 1616 Windows Installer Error Codes ERROR_INSTALL_REMOTE_DISALLOWED1640The current user is not permitted to perform installations from a client session of a server running the Terminal Server role service.

Environment Windows Resolving the problem The simplest work-around is to copy all the .MST file to the directory in the error message. http://madeleinebrand.com/error-code/installation-error-code-1639-fix-it.html Cannot open database file. Hope it helps. System error -2147287037 1: 2203 2: C:\INSTAL~1\EXP\image\db2\Windows\SERVER\1033.MST 3: -2147287037 Error applying transforms. There Was An Error Applying Transforms. Verify That The Specified Transform Paths Are Valid.

Consult the Windows Installer SDK for detailed command-line help. ERROR_INVALID_PATCH_XML1650The XML patch data is invalid. Contact your support personnel. http://madeleinebrand.com/error-code/installation-error-1903.html More info here 1621 ERROR_INSTALL_UI_FAILURE There was an error starting the Windows Installer service user interface.

Contact your system administrator. 1626 ERROR_FUNCTION_NOT_CALLED Function could not be executed. 1627 ERROR_FUNCTION_FAILED Function failed during execution. 1628 ERROR_INVALID_TABLE Invalid or unknown table specified. 1629 ERROR_DATATYPE_MISMATCH Data supplied is of wrong Windows Installer Returned 1613 Vmware ERROR_INSTALL_TEMP_UNWRITABLE1632The Temp folder is either full or inaccessible. ERROR_INSTALL_ALREADY_RUNNING1618Another installation is already in progress.

Privacy statement  © 2016 Microsoft.

If you choose to participate, the online survey will be presented to you when you leave the Technet Web site.Would you like to participate? Toggle navigation Software Tips Questions Blogs Links Communities Questions & Answers Help with MSI 1624 Help with MSI 1624 AppDeploy.com How helpful is this to you? For example if both 9.3.3 and 9.3.4 patches have been downloaded, install the 9.3.3 patch first followed by the 9.3.4 patch. Windows Installer Returned 1639 Downloads and tools Windows 10 dev tools Visual Studio Windows SDK Windows Store badges Essentials API reference (Windows apps) API reference (desktop apps) Code samples How-to guides (Windows apps) Learning resources

Please re-enable javascript to access full functionality. Solution: just don't cancel it 1603 ERROR_INSTALL_FAILURE Fatal error during installation. This message is indicative of a success. check over here ERROR_INVALID_HANDLE_STATE1609The handle is in an invalid state.

Verify that the specified transform paths are valid. Tech Reviews Tech News Tech How To Best Tech Reviews Tech Buying Advice Laptop Reviews PC Reviews Printer Reviews Smartphone Reviews Tablet Reviews Wearables Reviews Storage Reviews Antivirus Reviews Latest Deals Cooke Thursday, November 11, 2010 4:20 AM Reply | Quote Answers 0 Sign in to vote Hi, Installer Error 1624 means There was an error applying transforms. Answered 02/18/2007 by: williamp Please log in to comment Please log in to comment Answer this question or Comment on this question for clarity AnswerSubmit Don't be a Stranger!

Available beginning with Windows Installer version 3.0. Available beginning with Windows Installer version 4.0. Microsoft Customer Support Microsoft Community Forums Windows Client   Sign in United States (English) Brasil (Português)Česká republika (Čeština)Deutschland (Deutsch)España (Español)France (Français)Indonesia (Bahasa)Italia (Italiano)România (Română)Türkiye (Türkçe)Россия (Русский)ישראל (עברית)المملكة العربية السعودية (العربية)ไทย (ไทย)대한민국 (한국어)中华人民共和国 Like Show 0 Likes(0) Actions 7.

ERROR_SUCCESS_REBOOT_REQUIRED3010A restart is required to complete the install. Installation of this version cannot continue. MSI (c) (B4:34) [19:10:37:934]: Windows Installer installed the product. ERROR_INSTALL_REJECTED1654The app that you are trying to run is not supported on this version of Windows.

ERROR_INSTALL_TRANSFORM_REJECTED1644One or more customizations are not permitted by system policy. If ERROR_SUCCESS_REBOOT_REQUIRED is returned, the installation completed successfully but a reboot is required to complete the installation operation.   Note  If you are a user experiencing difficulty with your computer either during ERROR_PATCH_REMOVAL_UNSUPPORTED1646The patch package is not a removable patch package. Contact your application vendor.